{"text_format":"1","workbook":"xlsx","n_sheets":10,"sheets":["Identité","Notice","NQE","Données graphiques","Diagnostic simple","Tableau multi-paramètres","Source NQE & VGE","Matrice réponse","Source NQE","Légende diag"],"not_rendered":{"charts":3,"images":4,"macros":1,"external_links":3,"defined_names":12,"comments":3,"pivot_tables":0},"unopened":[],"bounds":{"document_bytes":16777216,"sheet_cells":100000,"rows_first":2000,"rows_last":500,"rows_between":2000,"halvings":0,"cell_chars":16384,"cell_head_chars":4096},"cells_cut":0,"cells_raw":0,"read":"whole","date_system":"1900"}

{"sheet":"Identité","index":0,"n_rows":12,"n_cols":3,"rows_kept":12,"cut":false,"hidden":false,"merged":[]}
["Objectif :"," évaluation de l'impact de rejets industriels"]
[]
["Auteur :","SPE/AERM"]
[]
["ACTION","Date","DESCRIPTION"]
["CREATION","2008-05-23","V1"]
["MAJ","2009-01-28","intégration des NQE de la Directive Fille du 16 décembre 2008"]
["MAJ","2010-03-01","intégration des NQE de l'arrêté du 25 janvier 2010 pour l'état chimique et pour l'état écologique"]
["MAJ","2010-09-01","Intégration des NQE de l'arrêté du 8 juillet 2010"]
["MAJ","2018-01-29"]
["MAJ","2018-11-28","Verification NQE conformité AM 27/7/2018"]
["MAJ","2020-06-30","introduction VGE sulfates et Chlorures"]

{"sheet":"Notice","index":1,"n_rows":22,"n_cols":5,"rows_kept":22,"cut":false,"hidden":false,"merged":[[13,0,13,4],[2,0,2,4]]}
["Notice"]
["Ce tableur est un outil d'évaluation théorique pour une première approche de l'impact. Il ne se substitue pas à un calcul des apports par bassin versant, en particulier dans le cas des macropolluants."]
["Pour un projet"]
[]
["Diagnostic général","contexte","impact du projet","investigation","précaution"]
["diag conc vert + diag flux vert","milieu peu dégradé + apport projet faible","rejet acceptable","sans objet","si substance concernée par objectif de réduction SDAGE, substitution ou nécessité de définir un échéancier de réduction"]
["diag conc orange + diag flux vert","milieu déjà dégradé + apport projet faible","seuil d'alerte dépassé","définir les différents apports de la substance considérée","si substance concernée par objectif de réduction SDAGE, substitution ou nécessité de définir un échéancier de réduction"]
["diag conc vert + diag flux orange","milieu peu dégradé + apport projet n'est pas négligeable (>10% du FMA)","rejet acceptable","rejet acceptable dans le cas ou le projet est le seul contributeur pour la substance sinon définir les différents apports de la substance considérée + explorer les pistes de réduction du flux (zéro rejet, recyclage, substitution, nature du traitement)","si substance concernée par objectif de réduction SDAGE, substitution ou nécessité de définir un échéancier de réduction"]
["diag conc orange + diag flux orange","milieu déjà dégradé + apport projet n'est pas négligeable (>10% du FMA)","seuil d'alerte dépassé","définir les différents apports de la substance considérée + explorer les pistes de réduction du flux (zéro rejet, recyclage, substitution, nature du traitement)","si substance concernée par objectif de réduction SDAGE, substitution ou nécessité de définir un échéancier de réduction"]
["diag conc rouge ","milieu en mauvais état","rejet inacceptable","envisager la substitution"]
["diag flux rouge","apport du projet supérieur à l'admissibilité du milieu","seuil d'alerte dépassé avec risque de déclassement du fait du projet","nécessité de réduire l'apport ou envisager la substitution","si substance concernée par objectif de réduction SDAGE, substitution ou nécessité de définir un échéancier de réduction"]
[]
[]
["Pour un établissement existant sans projet (action SDAGE)"]
[]
["Diagnostic général","contexte","impact du projet","investigation","précaution"]
["diag conc vert + diag flux vert","milieu peu dégradé + apport projet faible","rejet acceptable","sans objet","si substance concernée par objectif de réduction SDAGE, substitution ou nécessité de définir un échéancier de réduction en lien avec les PAOT"]
["diag conc orange + diag flux vert","milieu déjà dégradé + apport projet faible","seuil d'alerte dépassé","ajustement de la VLE aux conditions réelles de rejet","si substance concernée par objectif de réduction SDAGE, substitution ou nécessité de définir un échéancier de réduction en lien avec les PAOT"]
["diag conc vert + diag flux orange","milieu peu dégradé + apport projet n'est pas négligeable (>10% du FMA)","rejet acceptable","programme d'action visant à réduire l'apport de la substance  si établissement inscrit au PAOT","si substance concernée par objectif de réduction SDAGE, substitution ou nécessité de définir un échéancier de réduction en lien avec les PAOT"]
["diag conc orange + diag flux orange","milieu déjà dégradé + apport projet n'est pas négligeable (>10% du FMA)","seuil d'alerte dépassé","programme d'action visant à réduire l'apport de la substance  si établissement inscrit au PAOT + ajustement de la VLE aux conditions réelles de rejet","si substance concernée par objectif de réduction SDAGE, substitution ou nécessité de définir un échéancier de réduction en lien avec les PAOT"]
{"$rows_left_out":3}
{"sheet":"NQE","index":2,"n_rows":254,"n_cols":10,"rows_kept":254,"cut":false,"hidden":true,"merged":[]}
["Code SANDRE","Substance individuelle","Substance + conditions","Type DCE","unité","Remarques","origine seuil","NQE-MA","NQE-CMA","test"]
[1,null,"Sélectionner un paramètre"]
[1284,"1,1,1-Trichloroéthane","1,1,1-Trichloroéthane","liste II","µg/l",null,"Arrêté du 8 juillet 2010",26,"pas de seuil disponible"]
[1271,"1,1,2,2-Tétrachloroéthane","1,1,2,2-Tétrachloroéthane","liste II","µg/l",null,"circulaire du 7 mai 2007",140,"pas de seuil disponible"]
[1285,"1,1,2-Trichloroéthane","1,1,2-Trichloroéthane","liste II","µg/l",null,"Arrêté du 8 juillet 2010",300,"pas de seuil disponible"]
[1160,"1,1-Dichloroéthane","1,1-Dichloroéthane","liste II","µg/l",null,"Arrêté du 8 juillet 2010",92,"pas de seuil disponible"]
[1162,"1,1-Dichloroéthylène","1,1-Dichloroéthylène","liste II","µg/l",null,"circulaire du 7 mai 2007",11.6,"pas de seuil disponible"]
[1631,"1,2,4,5-Tétrachlorobenzène","1,2,4,5-Tétrachlorobenzène","liste II","µg/l",null,"circulaire du 7 mai 2007",0.32,"pas de seuil disponible"]
[1165,"1,2-Dichlorobenzène","1,2-Dichlorobenzène","liste II","µg/l",null,"Arrêté du 8 juillet 2010",10,"pas de seuil disponible"]
[1161,"1,2-Dichloroéthane","1,2-Dichloroéthane","Substance Prioritaire","µg/l",null,"arrêté du 27 juillet 2015 - annexe 8",10,"pas de seuil disponible"]
[1163,"1,2-Dichloroéthylène","1,2-Dichloroéthylène","liste II","µg/l",null,"circulaire du 7 mai 2007",1100,"pas de seuil disponible"]
[1164,"1,3-Dichlorobenzène","1,3-Dichlorobenzène","liste II","µg/l",null,"Arrêté du 8 juillet 2010",10,"pas de seuil disponible"]
[1166,"1,4-Dichlorobenzène","1,4-Dichlorobenzène","liste II","µg/l",null,"Arrêté du 8 juillet 2010",20,"pas de seuil disponible"]
[1469,"1-Chloro-2-nitrobenzène","1-Chloro-2-nitrobenzène","liste II","µg/l",null,"circulaire du 7 mai 2007",26,"pas de seuil disponible"]
[1468,"1-Chloro-3-nitrobenzène","1-Chloro-3-nitrobenzène","liste II","µg/l",null,"circulaire du 7 mai 2007",3.2,"pas de seuil disponible"]
[1470,"1-Chloro-4nitrobenzène","1-Chloro-4nitrobenzène","liste II","µg/l",null,"circulaire du 7 mai 2007",2,"pas de seuil disponible"]
[1640,"2 Méthylphénol","2 Méthylphénol","-","µg/l",null,"SEQ Eau V2 (limite vert/jaune potentialité biologique)",100,"pas de seuil disponible"]
[1141,"2,4-D (dont sels de 2,4-D et esters de 2,4-D)","2,4-D (dont sels de 2,4-D et esters de 2,4-D)","liste II-Etat écologique","µg/l",null,"arrêté du 27 juillet 2015",2.2000000000000002,"pas de seuil disponible"]
[99999,"2,4-D Acide","2,4-D Acide","liste II","µg/l","famille 2,4-D (seuil de la famille 1,5µg/l)","SEQ Eau V2 (limite vert/jaune potentialité biologique)","pas de seuil disponible","pas de seuil disponible"]
[2522,"2,4-D Ester éthylhexyl","2,4-D Ester éthylhexyl","liste II","µg/l","famille 2,4-D (seuil de la famille 1,5µg/l)","SEQ Eau V2 (limite vert/jaune potentialité biologique)","pas de seuil disponible","pas de seuil disponible"]
{"$rows_left_out":235}
{"sheet":"Données graphiques","index":3,"n_rows":14,"n_cols":8,"rows_kept":14,"cut":false,"hidden":true,"merged":[]}
[]
[null,null,{"$f":"'Diagnostic simple'!B9&\" (µg/L)\"","v":"Sélectionner un paramètre (µg/L)"},{"$f":"'Diagnostic simple'!C9&\" (µg/L)\"","v":" (µg/L)"},"NQE-MA (µg/L)","NQE-CMA (µg/L)","Seuil de sécurité (80% de la NQE)","Seuil de sécurité (80% de la NQE)"]
[null,"amont",{"$f":"'Diagnostic simple'!C34","v":0},{"$f":"'Diagnostic simple'!C34","v":0},{"$f":"'Diagnostic simple'!$C$22","v":0},{"$f":"'Diagnostic simple'!$C$23","v":0},{"$f":"E3*0.8","v":0},{"$f":"F3*0.8","v":0}]
[null,"avant rejet",{"$f":"C3","v":0},{"$f":"D3","v":0},{"$f":"'Diagnostic simple'!$C$22","v":0},{"$f":"'Diagnostic simple'!$C$23","v":0},{"$f":"E4*0.8","v":0},{"$f":"F4*0.8","v":0}]
[null,"après rejet",{"$f":"('Diagnostic simple'!$C$31*'Diagnostic simple'!$C$34+'Diagnostic simple'!$C$11/3600*'Diagnostic simple'!$C$14)/('Diagnostic simple'!$C$31+'Diagnostic simple'!$C$11/3600)","v":{"$error":"#DIV/0!"}},{"$f":"'Diagnostic simple'!C41","v":{"$error":"#DIV/0!"}},{"$f":"'Diagnostic simple'!$C$22","v":0},{"$f":"'Diagnostic simple'!$C$23","v":0},{"$f":"E5*0.8","v":0},0]
[null,"aval",{"$f":"C5","v":{"$error":"#DIV/0!"}},{"$f":"D5","v":{"$error":"#DIV/0!"}},{"$f":"'Diagnostic simple'!$C$22","v":0},{"$f":"'Diagnostic simple'!$C$23","v":0},{"$f":"E6*0.8","v":0},0]
[]
[]
[]
[]
[]
[null,null,null,null,"FMA","Rejet","% du FMA","% alerte FMA"]
[null,null,null,"Situation moyenne",{"$f":"'Diagnostic simple'!C35","v":0},{"$f":"'Diagnostic simple'!C16","v":0},{"$f":"F13/E13*100","v":{"$error":"#DIV/0!"}},80]
[null,null,null,"Situation maximale",{"$f":"'Diagnostic simple'!C36","v":0},{"$f":"'Diagnostic simple'!C17","v":0},{"$f":"F14/E14*100","v":{"$error":"#DIV/0!"}},80]

{"sheet":"Diagnostic simple","index":4,"n_rows":82,"n_cols":5,"rows_kept":82,"cut":false,"hidden":false,"merged":[[8,1,8,2],[81,1,81,2],[3,1,3,4],[1,1,1,4]]}
[]
[null,"Evaluation de l'impact d'un rejet polluant sur le milieu récepteur au regard des normes de qualité environnementales (NQE)"]
[]
[null,"Avertissement\n* outil donné à titre d'information ne pouvant être utilisé à des fins de justification.\n* Si la substance rejetée est identifiée comme substance dangereuse prioritaire au titre de la DCE, le rejet devra à terme être nul.\n* Au-delà du résultat fourni, il convient de vérifier la qualité effective du milieu récepteur sur le polluant considéré pour vérifier l'impact réel de la charge émise par l'établissement."]
[]
[null,"Connaissance du rejet industriel"]
[]
[null,"choix du paramètre polluant :"]
[null,"Sélectionner un paramètre"]
[]
[null,"débit moyen du rejet industriel en m3/h"]
[null,"débit maximal du rejet industriel en m3/h"]
[]
[null,"concentration du polluant dans le rejet industriel en µg/L"]
[]
[null,"flux industriel moyen en g/j",{"$f":"$C$11*$C$14*24/1000","v":0}]
[null,"flux industriel maximal en g/j",{"$f":"$C$12*$C$14*24/1000","v":0}]
[]
[]
[null,"Connaissance du milieu naturel"]
{"$rows_left_out":63}
{"sheet":"Tableau multi-paramètres","index":5,"n_rows":13,"n_cols":22,"rows_kept":13,"cut":false,"hidden":false,"merged":[[2,0,2,20],[11,3,11,10],[11,11,11,18],[11,19,11,20]]}
[]
[]
["Evaluation de l'impact local d'un rejet polluant sur le milieu récepteur au regard des normes de qualité environnementales (NQE)"]
["Tableau multi-paramètres"]
[]
["Débit d'étiage du milieu en amont du rejet (QMNA1/5) en m3/s",null,{"$f":"\"soit \"&B6*3600*24&\" m3/j\"","v":"soit 0 m3/j"},null,null,null,"diagnostic concentration","diagnostic flux","diagnostic rejet moyen","diagnostic concentration","diagnostic flux","diagnostic rejet max",null,null,null,null,null,null,"Base de données hydro.eaufrance"]
["Débit du rejet moyen mensuel en m3/j",null,null,null,null,null,{"$f":"VLOOKUP(IF(D10<0.1*H10,1,IF(D10<0.8*H10,2,IF(D10>H10,4,3))),'Matrice réponse'!$A$21:$B$24,2,0)","v":{"$error":"#VALUE!"}},{"$f":"VLOOKUP(IF(G10<10%,1,IF(G10<80%,2,3)),'Matrice réponse'!$A$32:$B$34,2,0)","v":"Flux rejet moyen > 80% du flux théorique admissible"},{"$f":"VLOOKUP(MAX(IF(D10<0.1*H10,1,IF(D10<0.8*H10,2,IF(D10>H10,4,3))),IF(G10<10%,1,IF(G10<80%,2,3))),'Matrice réponse'!$B$6:$C$9,2,0)","v":{"$error":"#VALUE!"}},{"$f":"VLOOKUP(IF(L10<0.1*P10,1,IF(L10<0.8*P10,2,IF(L10>P10,4,3))),'Matrice réponse'!$A$21:$B$24,2,0)","v":{"$error":"#VALUE!"}},{"$f":"VLOOKUP(IF(O10<10%,1,IF(O10<80%,2,3)),'Matrice réponse'!$A$38:$B$40,2,0)","v":"Flux rejet max > 80% du flux théorique admissible"},{"$f":"VLOOKUP(MAX(IF(L10<0.1*P10,1,IF(L10<0.8*P10,2,IF(L10>P10,4,3))),IF(O10<10%,1,IF(O10<80%,2,3))),'Matrice réponse'!$B$6:$C$9,2,0)","v":{"$error":"#VALUE!"}},null,null,null,null,null,null,"Catalogue des débits d'étiage Rhin Meuse"]
["Débit maximal du rejet en m3/j",null,null,null,null,null,null,null,null,null,null,null,null,null,null,null,null,null,"SIE Rhin Meuse"]
[]
[null,0,0,{"$f":"IF(A10=\"\",\"\",($B$6*86400*C10+B10*$B$7)/($B$6*86400+$B$7))","v":""},{"$f":"B10*$B$7/1000","v":0},{"$f":"IF(ISTEXT(H10),\"\",IF(H10/1000*($B$6*86400+$B$7)-(C10/1000*$B$6*86400)<=0,\"pas de rejet possible\",H10/1000*($B$6*86400+$B$7)-(C10/1000*$B$6*86400)))","v":""},{"$f":"IF(ISNUMBER(F10)=FALSE,\"\",E10/F10)","v":""},{"$f":"IF($A10=\"\",\"\",VLOOKUP($A10,NQE!$C$2:$H$261,6,0))","v":""},{"$f":"IF(ISTEXT(H10),\"\",IF(D10<0.1*H10,1,IF(D10<0.8*H10,2,IF(D10>H10,4,3))))","v":""},{"$f":"IF(ISTEXT(H10),\"\",IF(G10<10%,1,IF(G10<80%,2,3)))","v":""},{"$f":"IF(ISTEXT(H10),\"impact non calculé\",VLOOKUP(MAX(IF(D10<0.1*H10,1,IF(D10<0.8*H10,2,IF(D10>H10,4,3))),IF(G10<10%,1,IF(G10<80%,2,3))),'Matrice réponse'!$B$6:$C$9,2,0))","v":"impact non calculé"},{"$f":"IF(A10=\"\",\"\",($B$6*86400*C10+B10*$B$8)/($B$6*86400+$B$8))","v":""},{"$f":"B10*$B$8/1000","v":0},{"$f":"IF(ISTEXT(P10),\"\",IF(P10/1000*($B$6*86400+$B$8)-(C10/1000*$B$6*86400)<=0,\"pas de rejet possible\",P10/1000*($B$6*86400+$B$8)-(C10/1000*$B$6*86400)))","v":""},{"$f":"IF(ISNUMBER(N10)=FALSE,\"\",M10/N10)","v":""},{"$f":"IF($A10=\"\",\"\",VLOOKUP($A10,NQE!$C$2:$I$261,7,0))","v":""},{"$f":"IF(ISTEXT(P10),\"\",IF(L10<0.1*P10,1,IF(L10<0.8*P10,2,IF(L10>P10,4,3))))","v":""},{"$f":"IF(ISTEXT(P10),\"\",IF(O10<10%,1,IF(O10<80%,2,3)))","v":""},{"$f":"IF(ISTEXT(P10),\"impact non calculé\",VLOOKUP(MAX(IF(L10<0.1*P10,1,IF(L10<0.8*P10,2,IF(L10>P10,4,3))),IF(O10<10%,1,IF(O10<80%,2,3))),'Matrice réponse'!$B$6:$C$9,2,0))","v":"impact non calculé"},{"$f":"IF($A10=\"\",\"\",VLOOKUP($A10,NQE!$C$2:$H$261,5,0))","v":""},{"$f":"IF($A10=\"\",\"\",VLOOKUP($A10,NQE!$C$2:$H$261,2,0))","v":""},{"$f":"MAX(IF(D10<0.1*H10,1,IF(D10<0.8*H10,2,IF(D10>H10,4,3))),IF(G10<10%,1,IF(G10<80%,2,3)),IF(ISTEXT(P10),1,IF(L10<0.1*P10,1,IF(L10<0.8*P10,2,IF(L10>P10,4,3)))),IF(ISTEXT(P10),1,IF(O10<10%,1,IF(O10<80%,2,3))))","v":{"$error":"#VALUE!"}}]
[]
[null,null,null,"Impact rejet moyen",null,null,null,null,null,null,null,"Impact rejet max",null,null,null,null,null,null,null,"Information substance"]
["Paramètre","Concentration du  rejet (µg/L)","Concentration dans le milieu en amont du rejet (µg/L)","Concentration estimée dans le milieu en aval du rejet (µg/L)","Flux émis (g/j)","Flux admissible (g/j)","Ratio flux émis / flux admissible","NQE-MA (µg/L)","diag conc","diag flux","diagnostic rejet moyen","Concentration estimée dans le milieu en aval du rejet (µg/L)","Flux émis (g/j)","Flux admissible (g/j)","Ratio flux émis / flux admissible","NQE-CMA (µg/L)","diag conc","diag flux","diagnostic rejet max","Origine de la NQE","Type de substance","Synthèse numérique impact"]

{"sheet":"Source NQE & VGE","index":6,"n_rows":159,"n_cols":12,"rows_kept":159,"cut":false,"hidden":false,"merged":[[155,11,156,11],[157,0,158,0],[157,1,158,1],[157,2,158,2],[157,3,158,3],[157,4,158,4],[157,5,158,5],[157,10,158,10],[157,11,158,11],[8,0,8,2],[8,3,8,9],[8,10,8,11],[155,0,156,0],[155,1,156,1],[155,2,156,2],[155,3,156,3],[155,4,156,4],[155,5,156,5],[155,10,156,10],[0,0,0,1],[1,0,1,1],[2,0,2,1],[3,0,3,1],[4,0,4,1],[5,0,5,1]]}
["Légende"]
["CAS :  Chemical   Abstracts   Service"]
["NQE : Norme de Qualité Environmentale"]
["VGE : Valeur Guide Environmentale"]
["MA: moyenne annuelle"]
["CMA: concentration maximale admissible"]
[]
[]
["Substance",null,null,"Valeur de référence",null,null,null,null,null,null,"Limite analytique"]
["CAS","Nom","Code\nSANDRE","Nature de la valeur réglementaire","Texte de référence pour la NQE","Classement","Concentration Moyenne Annuelle (NQE-MA) - Eaux de surface intérieures (µg/L)","Concentration Moyenne Annuelle (NQE-MA) - eaux de surface côtières et de transition (µg/L)","Concentration Maximale Admissible (NQE-CMA) - Eaux de surface intérieures (µg/L)","Concentration Maximale Admissible (NQE-CMA) – eaux de surface côtières et de transition (µg/L)","Texte de référence","LQ « eau résiduaire »"]
["15972-60-8","Alachlore",1101,"NQE","Arrêté du 25 janvier 2010","SP",0.3,0.3,0.7,0.7,"Avis 19/10/2019","0,02 µg/l"]
[{"$error":"#N/A"},"Anthracène",1458,"NQE","Arrêté du 25 janvier 2010","SDP",0.1,0.1,0.1,0.1,"Avis 19/10/2019","0,01 µg/l"]
["1912-24-9","Atrazine",1107,"NQE","Arrêté du 25 janvier 2010","SP",0.6,0.6,2,2,"Avis 19/10/2019","0,03 µg/l"]
["71-43-2","Benzène",1114,"NQE","Arrêté du 25 janvier 2010","SP",10,8,50,50,"Avis 19/10/2019","1 µg/l"]
["sans objet","Diphényléthers bromés - sum of BDEs (Hexa BDE 154, Hexa BDE 153, Penta BDE 100, Penta BDE 99, Tétra BDE 47, Tri BDE 28)","/","NQE","Arrêté du 25 janvier 2010","SDP","0,0085 (µg/kg biote)","0,0085 (µg/kg biote)",0.14000000000000001,1.4E-2,"Avis 19/10/2019","0,02 µg/l"]
["68631-49-2","Hexa BDE 153",2912,"NQE","Arrêté du 25 janvier 2010","SDP","cf. sum of BDEs","cf. sum of BDEs","cf. sum of BDEs","cf. sum of BDEs","Avis 19/10/2019","0,02 µg/l"]
["207122-15-4","Hexa BDE 154",2911,"NQE","Arrêté du 25 janvier 2010","SDP","cf. sum of BDEs","cf. sum of BDEs","cf. sum of BDEs","cf. sum of BDEs","Avis 19/10/2019","0,02 µg/l"]
["189084-64-8","Penta BDE 100",2915,"NQE","Arrêté du 25 janvier 2010","SDP","cf. sum of BDEs","cf. sum of BDEs","cf. sum of BDEs","cf. sum of BDEs","Avis 19/10/2019","0,02 µg/l"]
["60348-60-9","Penta BDE 99",2916,"NQE","Arrêté du 25 janvier 2010","SDP","cf. sum of BDEs","cf. sum of BDEs","cf. sum of BDEs","cf. sum of BDEs","Avis 19/10/2019","0,02 µg/l"]
["32534-81-9","Pentabromodiphényléther",1921,"NQE","Arrêté du 25 janvier 2010","SDP","cf. sum of BDEs","cf. sum of BDEs","cf. sum of BDEs","cf. sum of BDEs","Avis 19/10/2019","0,1 µg/l"]
{"$rows_left_out":140}
{"sheet":"Matrice réponse","index":7,"n_rows":40,"n_cols":3,"rows_kept":40,"cut":false,"hidden":true,"merged":[]}
[null,"Matrice des répones"]
[]
[null,"NB : pour alerter sur la nécessité de faire un bilan apport macropol"]
[]
[]
[null,1,"rejet acceptable"]
[null,2,"rejet acceptable"]
[null,3,"seuil d'alerte dépassé"]
[null,4,"rejet inacceptable"]
[]
[null,"cas","réponse"]
["NQE-MA","conc ajouté comprise entre 0,8xNQE et 1xNQE","seuil d'alerte dépassé pour NQE-MA"]
["NQE-MA","conc ajouté comprise supérieure NQE","rejet inacceptable"]
["NQE-MA","conc ajouté inf 0.1NQE","rejet acceptable"]
["NQE-CMA","conc ajouté comprise entre 0,8NQE et NQE"]
["NQE-CMA","conc ajouté comprise supérieure NQE"]
["NQE-CMA","conc ajouté inf 0.1NQE"]
[]
[]
["Test de la concentration ajoutée après rejet moyen"]
{"$rows_left_out":21}
{"sheet":"Source NQE","index":8,"n_rows":99,"n_cols":20,"rows_kept":99,"cut":false,"hidden":true,"merged":[[0,14,1,14],[0,18,0,19],[0,0,1,0],[0,1,1,1],[0,2,1,2],[0,3,1,3],[0,4,1,4],[0,5,1,5]]}
["Famille","Substances","Code SANDRE","Classement","Substance à rechercher en entrée station","Substance à rechercher en sortie station",null,null,null,null,"NQE",null,null,null,"Flux GEREP annuel (kg/an)",null,"LQ",null,"Analyses en entrée station"]
[null,null,null,null,null,null,"Texte de référence pour la NQE","NQE MA Eaux de surface intérieures(mg/l)","Vérification PSEE","Verification directive","NQE MA autres eaux de surface(mg/l)","NQE CMA Eaux de surface intérieures  (mg/l)","Verification directive","NQE CMA Autres eaux de surface (mg/l)",null,"Texte de référence pour LQ","LQ\nEaux en sortie & eaux en entrée sans séparation des fractions (µg/l)","LQ\nEaux en entrée avec séparation des fractions (µg/l)","Substances à analyser sans séparation de phases","Substances recommandées pour analyse dans les deux phases"]
["COHV","1,2 dichloroéthane",1161,"SP","x","x","AM 25/01/2010",10,{"$f":"VLOOKUP(C3,'[1]PSEE 27_7_2015'!#REF!,15,FALSE)","v":{"$error":"#REF!"}},{"$f":"VLOOKUP(C3,[2]Feuil1!#REF!,2,FALSE)","v":{"$error":"#REF!"}},10,"sans objet",{"$f":"VLOOKUP(C3,[2]Feuil1!#REF!,4,FALSE)","v":{"$error":"#REF!"}},"sans objet",10,"Avis 08/11/2015",2,"/","X"]
["Pesticides","2,4 D",1141,"PSEE","x","x","AM 27/07/2015",2.2000000000000002,{"$f":"VLOOKUP(C4,'[1]PSEE 27_7_2015'!#REF!,15,FALSE)","v":{"$error":"#REF!"}},{"$f":"VLOOKUP(C4,[2]Feuil1!#REF!,2,FALSE)","v":{"$error":"#REF!"}},"Néant","Néant",{"$f":"VLOOKUP(C4,[2]Feuil1!#REF!,4,FALSE)","v":{"$error":"#REF!"}},"Néant","Néant","Avis 08/11/2015",0.1,{"$f":"2*Q4","v":0.2},null,"X"]
["Pesticides","2,4 MCPA",1212,"PSEE","x","x","AM 27/07/2015",0.5,{"$f":"VLOOKUP(C5,'[1]PSEE 27_7_2015'!#REF!,15,FALSE)","v":{"$error":"#REF!"}},{"$f":"VLOOKUP(C5,[2]Feuil1!#REF!,2,FALSE)","v":{"$error":"#REF!"}},"Néant","Néant",{"$f":"VLOOKUP(C5,[2]Feuil1!#REF!,4,FALSE)","v":{"$error":"#REF!"}},"Néant","Néant","Avis 08/11/2015",0.05,0.1,null,"X"]
["Pesticides","Aclonifene",1688,"SP","x","x","AM 25/01/2010",0.12,{"$f":"VLOOKUP(C6,'[1]PSEE 27_7_2015'!#REF!,15,FALSE)","v":{"$error":"#REF!"}},{"$f":"VLOOKUP(C6,[2]Feuil1!#REF!,2,FALSE)","v":{"$error":"#REF!"}},1.2E-2,0.12,{"$f":"VLOOKUP(C6,[2]Feuil1!#REF!,4,FALSE)","v":{"$error":"#REF!"}},1.2E-2,"Néant",null,0.1,0.2,null,"X"]
["Pesticides","Aminotriazole",1105,"PSEE","x","x","AM 27/07/2015",0.08,{"$f":"VLOOKUP(C7,'[1]PSEE 27_7_2015'!#REF!,15,FALSE)","v":{"$error":"#REF!"}},{"$f":"VLOOKUP(C7,[2]Feuil1!#REF!,2,FALSE)","v":{"$error":"#REF!"}},"Néant","Néant",{"$f":"VLOOKUP(C7,[2]Feuil1!#REF!,4,FALSE)","v":{"$error":"#REF!"}},"Néant","Néant",null,0.1,0.2,null,"X"]
["Pesticides","AMPA (Acide aminométhylphosphonique)",1907,"PSEE","x","x","AM 27/07/2015",452,{"$f":"VLOOKUP(C8,'[1]PSEE 27_7_2015'!#REF!,15,FALSE)","v":{"$error":"#REF!"}},{"$f":"VLOOKUP(C8,[2]Feuil1!#REF!,2,FALSE)","v":{"$error":"#REF!"}},"Néant","Néant",{"$f":"VLOOKUP(C8,[2]Feuil1!#REF!,4,FALSE)","v":{"$error":"#REF!"}},"Néant","Néant",null,0.1,0.2,null,"X"]
["HAP","Anthracène",1458,"SDP","x","x","AM 25/01/2010",0.1,{"$f":"VLOOKUP(C9,'[1]PSEE 27_7_2015'!#REF!,15,FALSE)","v":{"$error":"#REF!"}},{"$f":"VLOOKUP(C9,[2]Feuil1!#REF!,2,FALSE)","v":{"$error":"#REF!"}},0.1,0.1,{"$f":"VLOOKUP(C9,[2]Feuil1!#REF!,4,FALSE)","v":{"$error":"#REF!"}},0.1,1,"Avis 08/11/2015",0.01,0.01,null,"X"]
["Métaux","Arsenic (métal total)",1369,"PSEE","x","x","AM 25/01/2010",0.83,{"$f":"VLOOKUP(C10,'[1]PSEE 27_7_2015'!#REF!,15,FALSE)","v":{"$error":"#REF!"}},0.83,"Néant","Néant",{"$f":"VLOOKUP(C10,[2]Feuil1!#REF!,4,FALSE)","v":{"$error":"#REF!"}},"Néant",5,"Avis 08/11/2015",5,"/","X"]
["Pesticides","Azoxystrobine",1951,"PSEE","x","x","AM 27/07/2015",0.95,{"$f":"VLOOKUP(C11,'[1]PSEE 27_7_2015'!#REF!,15,FALSE)","v":{"$error":"#REF!"}},{"$f":"VLOOKUP(C11,[2]Feuil1!#REF!,2,FALSE)","v":{"$error":"#REF!"}},"Néant","Néant",{"$f":"VLOOKUP(C11,[2]Feuil1!#REF!,4,FALSE)","v":{"$error":"#REF!"}},"Néant","Néant",null,0.1,0.2,null,"X"]
["PBDE","BDE 028",2920,"SDP","x","x","AM 25/01/2010","Néant",null,null,"Néant","0,14(4)",0.14000000000000001,"0,014 (4)","1(6)",null,0.02,0.04,null,"X"]
["PBDE","BDE 047",2919,"SDP","x","x","AM 25/01/2010","Néant",null,null,"Néant","0,14(4)",0.14000000000000001,"0,014 (4)","1(6)",null,0.02,0.04,null,"X"]
["PBDE","BDE 099",2916,"SDP","x","x","AM 25/01/2010","Néant",null,null,"Néant","0,14(4)",0.14000000000000001,"0,014 (4)","1(6)",null,0.02,0.04,null,"X"]
["PBDE","BDE 100",2915,"SDP","x","x","AM 25/01/2010","Néant",null,null,"Néant","0,14(4)",0.14000000000000001,"0,014 (4)","1(6)",null,0.02,0.04,null,"X"]
["PBDE","BDE 153",2912,"SDP","x","x","AM 25/01/2010","Néant",null,null,"Néant","0,14(4)",0.14000000000000001,"0,014 (4)","1(6)",null,0.02,0.04,null,"X"]
["PBDE","BDE 154",2911,"SDP","x","x","AM 25/01/2010","Néant",null,null,"Néant","0,14(4)",0.14000000000000001,"0,014 (4)","1(6)",null,0.02,0.04,null,"X"]
["PBDE","BDE 183",2910,null,"x","x","AM 25/01/2010","Néant",null,null,"Néant","Néant",{"$f":"VLOOKUP(C18,[2]Feuil1!#REF!,4,FALSE)","v":{"$error":"#REF!"}},"Néant","1(6)",null,0.02,0.04,null,"X"]
["PBDE","BDE 209 (décabromodiphényl oxyde)",1815,null,"x","x","Néant","Néant",null,null,"Néant","Néant",{"$f":"VLOOKUP(C19,[2]Feuil1!#REF!,4,FALSE)","v":{"$error":"#REF!"}},"Néant","1(6)","Avis 08/11/2015",0.05,0.1,null,"X"]
["Pesticides","Bentazone",1113,"PSEE","x","x","AM 27/07/2015",70,{"$f":"VLOOKUP(C20,'[1]PSEE 27_7_2015'!#REF!,15,FALSE)","v":{"$error":"#REF!"}},{"$f":"VLOOKUP(C20,[2]Feuil1!#REF!,2,FALSE)","v":{"$error":"#REF!"}},"Néant","Néant",{"$f":"VLOOKUP(C20,[2]Feuil1!#REF!,4,FALSE)","v":{"$error":"#REF!"}},"Néant","Néant",null,0.05,0.1,null,"X"]
{"$rows_left_out":80}
{"sheet":"Légende diag","index":9,"n_rows":6,"n_cols":5,"rows_kept":6,"cut":false,"hidden":true,"merged":[]}
[]
[]
[null,"Légende diagnostic concentration",null,"Légende diagnostic flux"]
[null,1,"concentration ajoutée < 0,8 NQE",1,"Flux rejet < 10% du flux théorique admissible"]
[null,2,"concentration ajoutée comprise entre 0,8 NQE et NQE",2,"Flux rejet compris entre 10% et 80% du flux théorique admissible"]
[null,3,"concentration ajoutée > NQE",3,"Flux rejet > 80% du flux théorique admissible"]